{"text_format":"1","workbook":"xlsx","n_sheets":6,"sheets":["超硬・ハイス　選定計算","サーメットリーマ条件計算","切削計算","データ","データ01","注意事項"],"not_rendered":{"charts":0,"images":3,"macros":1,"external_links":0,"defined_names":46,"comments":0,"pivot_tables":0},"unopened":[],"bounds":{"document_bytes":16777216,"sheet_cells":100000,"rows_first":2000,"rows_last":500,"rows_between":2000,"halvings":0,"cell_chars":16384,"cell_head_chars":4096},"cells_cut":0,"cells_raw":0,"read":"whole","date_system":"1900"}

{"sheet":"超硬・ハイス　選定計算","index":0,"n_rows":57,"n_cols":9,"rows_kept":57,"cut":false,"hidden":false,"merged":[[56,2,57,4],[47,3,48,4],[43,1,45,9],[47,6,48,7],[50,6,51,7],[56,6,57,7],[47,8,48,8],[50,8,51,8],[53,8,54,8],[56,8,57,8],[53,6,54,7],[53,2,54,4],[35,6,37,7],[35,8,37,8],[36,1,37,2],[35,1,35,3],[50,2,51,4],[24,1,25,9],[27,6,29,7],[27,8,29,8],[32,1,33,9],[1,3,2,9],[3,3,4,9],[7,1,8,9],[14,1,15,9],[10,4,11,8],[10,1,11,2],[17,1,18,2],[17,4,18,8],[20,1,22,8],[5,1,6,2]]}
[]
[null,null,null,"エフ・ピー・ツール株式会社"]
[]
[null,null,null,"リーマ選定・切削条件計算ツール"]
[]
[]
[]
[null,"　　STEP.1　加工ワークの材質を選択してください。"]
[]
[]
[null,"被削材",null,null,"S○○Ｃ_炭素鋼"]
[]
[]
[]
[null,"　　STEP.2　対応リーマを選択してください。"]
[]
[]
[null,"型式",null,null,"CG/CM/CC"]
[]
[]
[null,{"$f":"VLOOKUP(E18,データ01!A104:B115,2,0)","v":"超硬Ｇシリーズ・・・φ０．２００～１２．１００　(０．００５mmとび)\n超硬μリーマ　・・・φ０．３００～１２．１００　(０．００１mmとび)\n超硬Ｃシリーズ・・・φ２．９１０～１２．１００　(０．００５mmとび)"}]
[]
[]
[]
[null,"　　STEP.3　刃径を入力してください。"]
[]
[]
[null,null,null,null,null,null,3,null,"mm"]
[]
[]
[]
[]
[null,"　　STEP.4　周速を入力してください。"]
[]
[]
[null,"参考範囲",null,null,null,null,12,null,"m/min"]
[null,{"$f":"VLOOKUP(E11&E18,データ!A15:B97,2,0)","v":"10～20"}]
[null,null,null,"m/min"]
[]
[]
[]
[]
[]
[null,"―参考切削条件―"]
[]
[]
[]
[null,null,null,"回転数",null,null,{"$f":"G36*1000/G28/3.14","v":1273.8853503184712},null,"min-1"]
[]
[]
[null,null,"f : 送り量（毎回転送り）",null,null,null,{"$f":"VLOOKUP(G28,データ!A101:'データ'!B116,2,1)","v":"0.025～0.075"},null,"mm/rev."]
[]
[]
[null,null,"取り代（直径に対して）",null,null,null,{"$f":"INDEX(データ01!B86:D101,MATCH(G28,データ01!A86:A101,1),MATCH(データ01!F85,データ01!B85:D85,0))","v":0.1},null,"mm"]
[]
[]
[null,null,"下穴径",null,null,null,{"$f":"G28-G54","v":2.9},null,"mm"]

{"sheet":"サーメットリーマ条件計算","index":1,"n_rows":57,"n_cols":10,"rows_kept":57,"cut":false,"hidden":false,"merged":[[56,8,57,8],[56,7,57,7],[53,2,54,4],[53,9,54,9],[56,2,57,4],[56,9,57,9],[53,6,54,6],[53,8,54,8],[53,7,54,7],[56,6,57,6],[47,3,48,4],[47,6,48,8],[47,9,48,9],[50,2,51,4],[50,6,51,8],[50,9,51,9],[43,1,45,10],[24,1,25,10],[27,6,29,8],[27,9,29,9],[1,3,2,10],[3,3,4,10],[5,1,6,2],[17,1,18,10],[20,1,21,2],[20,4,21,9],[7,1,8,10],[32,1,33,10],[35,1,35,3],[35,6,37,8],[35,9,37,9],[36,1,37,2]]}
[]
[null,null,null,"エフ・ピー・ツール株式会社"]
[]
[null,null,null,"サーメットリーマ切削条件計算ツール"]
[]
[]
[]
[null,"　　STEP.1　サーメットリーマ　　　型式：ＳＤ"]
[]
[]
[null,null,"サイズ・・・φ２．９００～１０．０５０　(０．００５㎜とび)"]
[]
[null,null,"・油性切削油にてお使いください。"]
[null,null,"・リーマ代はなるべく少な目が理想になります。"]
[null,null,"・下穴精度は可能な限り良好な状態でお願い致します。"]
[]
[]
[null,"　　STEP.2　ステンレスの種類を選択してください。"]
[]
[]
[null,"被削材",null,null,"オーステナイト系　SUS304/SUS316"]
[]
[]
[]
[null,"　　STEP.3　刃径を入力してください。"]
[]
[]
[null,null,null,null,null,null,2.9,null,null,"mm"]
[]
[]
[]
[]
[null,"　　STEP.4　周速を入力してください。"]
[]
[]
[null,"参考範囲",null,null,null,null,20,null,null,"m/min"]
[null,{"$f":"VLOOKUP(E21,データ!A134:'データ'!B136,2,0)","v":"20～30"}]
[null,null,null,"m/min"]
[]
[]
[]
[]
[]
[null,"―参考切削条件―"]
[]
[]
[]
[null,null,null,"回転数",null,null,{"$f":"G36*1000/G28/3.14","v":2196.3540522732264},null,null,"min-1"]
[]
[]
[null,null,"f : 送り量（毎回転送り）",null,null,null,{"$f":"VLOOKUP(G28,データ!A123:'データ'!B130,2,1)","v":"0.05～0.07"},null,null,"mm/rev."]
[]
[]
[null,null,"取り代（直径に対して）",null,null,null,{"$f":"VLOOKUP(G28,データ01!A121:'データ01'!B128,2,1)","v":0.05},"～",{"$f":"VLOOKUP(G28,データ01!A130:B137,2,1)","v":0.1},"mm"]
[]
[]
[null,null,"下穴径",null,null,null,{"$f":"G28-I54","v":2.8},"～",{"$f":"G28-G54","v":2.85},"mm"]

{"sheet":"切削計算","index":2,"n_rows":58,"n_cols":7,"rows_kept":58,"cut":false,"hidden":false,"merged":[[57,6,58,6],[44,4,45,5],[31,4,32,5],[51,4,52,5],[38,4,39,5],[54,4,55,5],[57,4,58,5],[41,4,42,5],[1,2,2,8],[3,2,4,8],[49,1,50,3],[51,6,52,6],[54,1,55,1],[54,6,55,6],[38,6,39,6],[41,1,42,1],[41,6,42,6],[44,6,45,6],[41,2,42,2],[28,1,29,1],[15,1,16,1],[36,1,37,3],[25,5,26,5],[25,6,26,6],[28,5,29,5],[28,6,29,6],[31,6,32,6],[23,1,24,3],[12,6,13,6],[10,1,11,2],[15,6,16,6],[18,6,19,6],[12,5,13,5],[18,5,19,5],[15,4,16,5]]}
[]
[null,null,"エフ・ピー・ツール株式会社"]
[]
[null,null,"切削計算ツール"]
[]
[]
[null,"V：周速（m/min）　",null,null,null,"f：送り量（mm/rev）"]
[null,"D：刃径（mm）",null,null,null,"F：送り速度（mm/min）"]
[null,"N：回転数（min⁻¹）"]
[]
[null,"周速（Ｖ）の計算式"]
[]
[null,null,null,null,null,"刃径（Ｄ）"]
[]
[]
[null,"Ｖ　＝","π×Ｄ×Ｎ",null,"回転数（Ｎ）"]
[null,null,1000]
[]
[null,null,null,null,null,"周速（Ｖ）",{"$f":"3.14*G13*G16/1000","v":0}]
[]
[]
[]
[]
[null,"回転数（Ｎ）の計算式"]
[]
[null,null,null,null,null,"周速（Ｖ)"]
[]
[]
[null,"Ｎ　＝","１０００Ｖ",null,null,"刃径（Ｄ）"]
[null,null,"πＤ"]
[]
[null,null,null,null,"回転数（Ｎ）",null,{"$f":"IFERROR(1000*G26/3.14/G29,\"0\")","v":"0"}]
[]
[]
[]
[]
[null,"送り速度（Ｆ）の計算式"]
[]
[null,null,null,null,"回転数（Ｎ)"]
[]
[]
[null,"Ｆ　＝","Ｎ　×　ｆ",null,"送り量（ｆ）"]
[]
[]
[null,null,null,null,"送り速度（Ｆ）",null,{"$f":"G39*G42","v":0}]
[]
[]
[]
[]
[null,"送り量（ｆ）の計算式"]
[]
[null,null,null,null,"送り速度（Ｆ）"]
[]
[]
[null,"ｆ　＝","Ｆ",null,"回転数（Ｎ）"]
[null,null,"Ｎ"]
[]
[null,null,null,null,"送り量（ｆ）",null,{"$f":"IFERROR(G52/G55,\"0\")","v":"0"}]

{"sheet":"データ","index":3,"n_rows":136,"n_cols":11,"rows_kept":136,"cut":false,"hidden":true,"merged":[]}
["対応被削材　プルダウン一覧"]
["SS_軟鋼","S○○Ｃ_炭素鋼","SCM・SUJ_合金鋼","SKH・SKD_工具鋼","SUS_ステンレス","FC・FCD_鋳鉄","A・ACD_アルミ","C_銅","HRC40_調質鋼","HRC50_調質鋼","HRC60_調質鋼"]
["CG/CM/CC","CG/CM/CC","CG/CM/CC","CG/CM/CC","CG/CM/CC","CG/CM/CC","CG/CM/CC","CG/CM/CC","CG/CM/CC","CG/CM/CC","CR/CR-H"]
["CB","CB","CB","CE/CE-H","CE/CE-H","CE/CE-H","CE/CE-H","CE/CE-H","CE/CE-H","CE/CE-H"]
["CE/CE-H","CE/CE-H","CE/CE-H","CR/CR-H","CR/CR-H","CP","HG","HG","CP","CR/CR-H"]
["CP","CP","CP","CP","CP","CH","HR","HR","CH","CP"]
["CH","CH","CH","CH","HG","HG","HD","HD","HG"]
["HG","HG","HG","HG","HB","HH","HB","HB","HR"]
["HR","HR","HR","HR",null,"HB",null,null,"HB"]
["HH","HH","HH","HB"]
["HB","HB","HB"]
[]
[null,null,null,null,null,null,null,"※ＣＦをプルダウンから削除。縦列4にＣＦを挿入で再表示可能"]
["被削材別周速"]
["SS_軟鋼CG/CM/CC","12～25"]
["SS_軟鋼CF","12～50"]
["SS_軟鋼CB","5～8"]
["SS_軟鋼CE/CE-H","10～30"]
["SS_軟鋼CP","20～100"]
["SS_軟鋼CH","20～35"]
["SS_軟鋼HG","10～25"]
["SS_軟鋼HR","5～15"]
["SS_軟鋼HH","10～20"]
["SS_軟鋼HB","10～25"]
["S○○Ｃ_炭素鋼CG/CM/CC","10～20"]
["S○○Ｃ_炭素鋼CF","10～40"]
["S○○Ｃ_炭素鋼CB","5～20"]
["S○○Ｃ_炭素鋼CE/CE-H","10～30"]
["S○○Ｃ_炭素鋼CP","20～100"]
["S○○Ｃ_炭素鋼CH","20～30",null,null,null,null,5.01]
["S○○Ｃ_炭素鋼HG","6～20"]
["S○○Ｃ_炭素鋼HR","3～10"]
["S○○Ｃ_炭素鋼HH","12～25"]
["S○○Ｃ_炭素鋼HB","6～20"]
["SCM・SUJ_合金鋼CG/CM/CC","8～15"]
["SCM・SUJ_合金鋼CF","8～30"]
["SCM・SUJ_合金鋼CB","5～15"]
["SCM・SUJ_合金鋼CE/CE-H","8～30"]
["SCM・SUJ_合金鋼CP","25～75",null,null,null,null,30]
["SCM・SUJ_合金鋼CH","15～30"]
["SCM・SUJ_合金鋼HG","6～20"]
["SCM・SUJ_合金鋼HR","3～6"]
["SCM・SUJ_合金鋼HH","10～20"]
["SCM・SUJ_合金鋼HB","6～20"]
["SKH・SKD_工具鋼CG/CM/CC","5～15"]
["SKH・SKD_工具鋼CF","5～30"]
["SKH・SKD_工具鋼CE/CE-H","5～30"]
["SKH・SKD_工具鋼CR/CR-H","15～30"]
["SKH・SKD_工具鋼CP","20～40"]
["SKH・SKD_工具鋼CH","10～25"]
["SKH・SKD_工具鋼HG","5～10"]
["SKH・SKD_工具鋼HR","3～4"]
["SKH・SKD_工具鋼HB","5～10"]
["SUS_ステンレスCG/CM/CC","5～12"]
["SUS_ステンレスCF","5～15"]
["SUS_ステンレスCE/CE-H","5～20"]
["SUS_ステンレスCR/CR-H","10～20"]
["SUS_ステンレスCP","15～50"]
["SUS_ステンレスHG","5～10"]
["SUS_ステンレスHB","5～10"]
["FC・FCD_鋳鉄CG/CM/CC","8～18"]
["FC・FCD_鋳鉄CF","8～36"]
["FC・FCD_鋳鉄CE/CE-H","8～30"]
["FC・FCD_鋳鉄CP","15～70"]
["FC・FCD_鋳鉄CH","20～35"]
["FC・FCD_鋳鉄HG","6～15"]
["FC・FCD_鋳鉄HH","12～20"]
["FC・FCD_鋳鉄HB","6～15"]
["A・ACD_アルミCG/CM/CC","15～30"]
["A・ACD_アルミCF","15～60"]
["A・ACD_アルミCE/CE-H","15～40"]
["A・ACD_アルミHG","10～30"]
["A・ACD_アルミHR","10～20"]
["A・ACD_アルミHD","15～30"]
["A・ACD_アルミHB","10～30"]
["C_銅CG/CM/CC","10～25"]
["C_銅CF","10～50"]
["C_銅CE/CE-H","10～30"]
["C_銅HG","10～25"]
["C_銅HR","8～15"]
["C_銅HD","10～20"]
["C_銅HB","10～25"]
["HRC40_調質鋼CG/CM/CC","5～15"]
["HRC40_調質鋼CF","5～40"]
["HRC40_調質鋼CE/CE-H","5～20"]
["HRC40_調質鋼CP","10～30"]
["HRC40_調質鋼CH","8～20"]
["HRC40_調質鋼HG","5～10"]
["HRC40_調質鋼HR","3～4"]
["HRC40_調質鋼HB","5～10"]
["HRC50_調質鋼CG/CM/CC","5～15"]
["HRC50_調質鋼CF","5～20"]
["HRC50_調質鋼CE/CE-H","5～15"]
["HRC50_調質鋼CR/CR-H","9～18"]
["HRC50_調質鋼CP","10～25"]
["HRC60_調質鋼CF","5～10"]
["HRC60_調質鋼CR/CR-H","6～12"]
[]
[]
["送り量"]
[0.5,"0.004～0.012"]
[1,"0.008～0.024"]
[2,"0.016～0.048"]
[3,"0.025～0.075"]
[4,"0.03～0.1"]
[5,"0.04～0.12"]
[6,"0.05～0.15"]
[7,"0.06～0.18"]
[8,"0.06～0.18"]
[9,"0.07～0.22"]
[10,"0.07～0.22"]
[12,"0.09～0.27"]
[14,"0.1～0.3"]
[16,"0.12～0.35"]
[18,"0.13～0.4"]
[20,"0.15～0.45"]
[]
[]
[]
["以下サーメット用データ"]
[]
["送り量"]
[2.9,"0.05～0.07"]
[4,"0.05～0.07"]
[5,"0.08～0.10"]
[6,"0.08～0.10"]
[7,"0.12～0.13"]
[8,"0.12～0.13"]
[9,"0.15～0.17"]
[10,"0.15～0.17"]
[]
[]
[]
["オーステナイト系　SUS304/SUS316","20～30"]
["マルテンサイト系　SUS420/SUS440","25～35"]
["フェライト系　SUS405/SUS430","25～35"]

{"sheet":"データ01","index":4,"n_rows":137,"n_cols":8,"rows_kept":137,"cut":false,"hidden":true,"merged":[]}
["SS_軟鋼CG/CM/CC","AC",null,"SS_軟鋼CG/CM/CC","③",null,"←","リーマ代組み合わせ"]
["SS_軟鋼CF","AC",null,"SS_軟鋼CF","③"]
["SS_軟鋼CB","AB",null,"SS_軟鋼CB","②"]
["SS_軟鋼CE/CE-H","AB",null,"SS_軟鋼CE/CE-H","②"]
["SS_軟鋼CP","AB",null,"SS_軟鋼CP","②"]
["SS_軟鋼CH","AC",null,"SS_軟鋼CH","③"]
["SS_軟鋼HG","AC",null,"SS_軟鋼HG","③"]
["SS_軟鋼HR","AB",null,"SS_軟鋼HR","②"]
["SS_軟鋼HH","AC",null,"SS_軟鋼HH","③"]
["SS_軟鋼HB","AC",null,"SS_軟鋼HB","③"]
["S○○Ｃ_炭素鋼CG/CM/CC","AC",null,"S○○Ｃ_炭素鋼CG/CM/CC","③"]
["S○○Ｃ_炭素鋼CF","AC",null,"S○○Ｃ_炭素鋼CF","③"]
["S○○Ｃ_炭素鋼CB","AB",null,"S○○Ｃ_炭素鋼CB","②"]
["S○○Ｃ_炭素鋼CE/CE-H","AB",null,"S○○Ｃ_炭素鋼CE/CE-H","②"]
["S○○Ｃ_炭素鋼CP","AB",null,"S○○Ｃ_炭素鋼CP","②"]
["S○○Ｃ_炭素鋼CH","AC",null,"S○○Ｃ_炭素鋼CH","③"]
["S○○Ｃ_炭素鋼HG","AC",null,"S○○Ｃ_炭素鋼HG","③"]
["S○○Ｃ_炭素鋼HR","AB",null,"S○○Ｃ_炭素鋼HR","②"]
["S○○Ｃ_炭素鋼HH","AC",null,"S○○Ｃ_炭素鋼HH","③"]
["S○○Ｃ_炭素鋼HB","AC",null,"S○○Ｃ_炭素鋼HB","③"]
["SCM・SUJ_合金鋼CG/CM/CC","AC",null,"SCM・SUJ_合金鋼CG/CM/CC","③"]
["SCM・SUJ_合金鋼CF","AC",null,"SCM・SUJ_合金鋼CF","③"]
["SCM・SUJ_合金鋼CB","AB",null,"SCM・SUJ_合金鋼CB","②"]
["SCM・SUJ_合金鋼CE/CE-H","AB",null,"SCM・SUJ_合金鋼CE/CE-H","②"]
["SCM・SUJ_合金鋼CP","AB",null,"SCM・SUJ_合金鋼CP","②"]
["SCM・SUJ_合金鋼CH","AC",null,"SCM・SUJ_合金鋼CH","③"]
["SCM・SUJ_合金鋼HG","AC",null,"SCM・SUJ_合金鋼HG","③"]
["SCM・SUJ_合金鋼HR","AB",null,"SCM・SUJ_合金鋼HR","②"]
["SCM・SUJ_合金鋼HH","AC",null,"SCM・SUJ_合金鋼HH","③"]
["SCM・SUJ_合金鋼HB","AC",null,"SCM・SUJ_合金鋼HB","③"]
["SKH・SKD_工具鋼CG/CM/CC","AC",null,"SKH・SKD_工具鋼CG/CM/CC","③"]
["SKH・SKD_工具鋼CF","AC",null,"SKH・SKD_工具鋼CF","③"]
["SKH・SKD_工具鋼CE/CE-H","AB",null,"SKH・SKD_工具鋼CE/CE-H","②"]
["SKH・SKD_工具鋼CR/CR-H","AC",null,"SKH・SKD_工具鋼CR/CR-H","③"]
["SKH・SKD_工具鋼CP","AB",null,"SKH・SKD_工具鋼CP","②"]
["SKH・SKD_工具鋼CH","AC",null,"SKH・SKD_工具鋼CH","③"]
["SKH・SKD_工具鋼HG","AB",null,"SKH・SKD_工具鋼HG","②"]
["SKH・SKD_工具鋼HR","AA",null,"SKH・SKD_工具鋼HR","①"]
["SKH・SKD_工具鋼HB","AB",null,"SKH・SKD_工具鋼HB","②"]
["SUS_ステンレスCG/CM/CC","AC",null,"SUS_ステンレスCG/CM/CC","③"]
["SUS_ステンレスCF","AC",null,"SUS_ステンレスCF","③"]
["SUS_ステンレスCE/CE-H","AB",null,"SUS_ステンレスCE/CE-H","②"]
["SUS_ステンレスCR/CR-H","AB",null,"SUS_ステンレスCR/CR-H","②"]
["SUS_ステンレスCP","AB",null,"SUS_ステンレスCP","②"]
["SUS_ステンレスHG","AA",null,"SUS_ステンレスHG","①"]
["SUS_ステンレスHB","AA",null,"SUS_ステンレスHB","①"]
["FC・FCD_鋳鉄CG/CM/CC","AC",null,"FC・FCD_鋳鉄CG/CM/CC","③"]
["FC・FCD_鋳鉄CF","AC",null,"FC・FCD_鋳鉄CF","③"]
["FC・FCD_鋳鉄CE/CE-H","AB",null,"FC・FCD_鋳鉄CE/CE-H","②"]
["FC・FCD_鋳鉄CP","AB",null,"FC・FCD_鋳鉄CP","②"]
["FC・FCD_鋳鉄CH","AC",null,"FC・FCD_鋳鉄CH","③"]
["FC・FCD_鋳鉄HG","AC",null,"FC・FCD_鋳鉄HG","③"]
["FC・FCD_鋳鉄HH","AC",null,"FC・FCD_鋳鉄HH","③"]
["FC・FCD_鋳鉄HB","AC",null,"FC・FCD_鋳鉄HB","③"]
["A・ACD_アルミCG/CM/CC","AC",null,"A・ACD_アルミCG/CM/CC","③"]
["A・ACD_アルミCF","AC",null,"A・ACD_アルミCF","③"]
["A・ACD_アルミCE/CE-H","AB",null,"A・ACD_アルミCE/CE-H","②"]
["A・ACD_アルミHG","AB",null,"A・ACD_アルミHG","②"]
["A・ACD_アルミHR","AB",null,"A・ACD_アルミHR","②"]
["A・ACD_アルミHD","AA",null,"A・ACD_アルミHD","①"]
["A・ACD_アルミHB","AB",null,"A・ACD_アルミHB","②"]
["C_銅CG/CM/CC","AB",null,"C_銅CG/CM/CC","②"]
["C_銅CF","AB",null,"C_銅CF","②"]
["C_銅CE/CE-H","AB",null,"C_銅CE/CE-H","②"]
["C_銅HG","AB",null,"C_銅HG","②"]
["C_銅HR","AB",null,"C_銅HR","②"]
["C_銅HD","AA",null,"C_銅HD","①"]
["C_銅HB","AB",null,"C_銅HB","②"]
["HRC40_調質鋼CG/CM/CC","AA",null,"HRC40_調質鋼CG/CM/CC","①"]
["HRC40_調質鋼CF","AA",null,"HRC40_調質鋼CF","①"]
["HRC40_調質鋼CE/CE-H","AA",null,"HRC40_調質鋼CE/CE-H","①"]
["HRC40_調質鋼CP","AB",null,"HRC40_調質鋼CP","②"]
["HRC40_調質鋼CH","AA",null,"HRC40_調質鋼CH","①"]
["HRC40_調質鋼HG","AA",null,"HRC40_調質鋼HG","①"]
["HRC40_調質鋼HR","AA",null,"HRC40_調質鋼HR","①"]
["HRC40_調質鋼HB","AA",null,"HRC40_調質鋼HB","①"]
["HRC50_調質鋼CG/CM/CC","AA",null,"HRC50_調質鋼CG/CM/CC","①"]
["HRC50_調質鋼CF","AA",null,"HRC50_調質鋼CF","①"]
["HRC50_調質鋼CE/CE-H","AA",null,"HRC50_調質鋼CE/CE-H","①"]
["HRC50_調質鋼CR/CR-H","AA",null,"HRC50_調質鋼CR/CR-H","①"]
["HRC50_調質鋼CP","AA",null,"HRC50_調質鋼CP","①"]
["HRC60_調質鋼CF","AA",null,"HRC60_調質鋼CF","①"]
["HRC60_調質鋼CR/CR-H","AA",null,"HRC60_調質鋼CR/CR-H","①"]
[]
[null,"AA","AB","AC",null,{"$f":"VLOOKUP('超硬・ハイス　選定計算'!E11&'超硬・ハイス　選定計算'!E18,A1:B83,2,0)","v":"AC"}]
[0.5,0.05,0.05,0.05]
[1,0.05,0.08,0.08]
[2,0.08,0.08,0.08]
[3,0.1,0.1,0.1]
[4,0.1,0.1,0.1]
[5,0.1,0.1,0.1]
[6,0.1,0.15,0.2]
[7,0.1,0.15,0.2]
[8,0.1,0.15,0.2]
[9,0.1,0.15,0.2]
[10,0.1,0.15,0.3]
[12,0.1,0.15,0.3]
[14,0.1,0.15,0.3]
[16,0.2,0.3,0.4]
[18,0.2,0.3,0.4]
[20,0.2,0.3,0.4]
[]
["各シリーズ　サイズ規格"]
["CG/CM/CC","超硬Ｇシリーズ・・・φ０．２００～１２．１００　(０．００５mmとび)\n超硬μリーマ　・・・φ０．３００～１２．１００　(０．００１mmとび)\n超硬Ｃシリーズ・・・φ２．９１０～１２．１００　(０．００５mmとび)"]
["CF","超硬ファインリーマ・・・φ２．９７０～１０．０２０ （限定サイズ）"]
["CB","超硬Ｂシリーズ・・・φ０．９０～１４．００　(０．０１mmとび)"]
["CE/CE-H","超硬Eシリーズ・・・φ１．０００～１４．０５０　(０．００５mmとび)\n超硬EシリーズOH付・・・φ２．９５０～１０．０５０　(０．００５mmとび)"]
["CR/CR-H","超硬Ｒシリーズ・・・φ１．０００～１２．１０　(０．０１mmとび)\n超硬ＲシリーズOH付・・・φ４．９７０～１０．０３０　(限定サイズ)"]
["CP","エフ　ピー　プラチナリーマ　φ２．９５０～１２．０５０　(０．００５mmとび)"]
["CH","超硬Ｈシリーズ・・・φ１．００～１６．００　(０．０１mmとび)"]
["HG","ハイス　ＦＰゴールドリーマ・・・φ１．０００～１４．１００　(０．００５mmとび)　"]
["HR","ハイス　ハンドリーマ・・・φ０．３００～２０．０００　(０．００５mmとび)"]
["HH","ハイス　ハイ・ヘリカルリーマ・・・φ１．５０～１６．４９　（０．０１mmとび）"]
["HD","ハイス　ＤＬＣリーマ・・・φ１．０００～１４．１００　（０．００５mmとび）　"]
["HB","ハイス　ショートリーマ・・・・・・φ１．０００～１２．１００　（０．００５mmとび）"]
[]
[]
["以下　サーメット用データ"]
[]
["取り代　上表が下限値、下表が上限値","AA"]
[2.9,0.05]
[4,0.05]
[5,0.05]
[6,0.05]
[7,0.05]
[8,0.05]
[9,0.05]
[10,0.05]
[]
[2.9,0.1]
[4,0.1]
[5,0.1]
[6,0.1]
[7,0.2]
[8,0.2]
[9,0.2]
[10,0.2]

{"sheet":"注意事項","index":5,"n_rows":33,"n_cols":1,"rows_kept":33,"cut":false,"hidden":false,"merged":[]}
[]
["エフ・ピー・ツール株式会社（以下、当社）のリーマ選定・切削条件計算ツールのご利用に際しては、"]
["以下の免責事項を必ずお読みいただき、すべての内容に同意していただける場合のみ、ご利用ください。"]
["同意いただけない場合は、計算ツールのご利用をお控えいただきますよう、宜しくお願い申し上げます。"]
[]
[]
[]
["＜注意事項＞"]
["　１.リーマ選定・切削条件計算ツールは2016年11月発行「リーマ総合カタログ vol.17」に準じています。"]
[]
["　２.計算結果は、一般的なケースを想定しての参考切削条件になります。調質の度合いやワーク形状、"]
["     加工環境に合わせて適正化してください。"]
[]
["　３.個々のケースに関してのアドバイスなどが必要な場合は、当社お問い合わせフォームまたはお電話で"]
["     ご相談されることをお勧めします。"]
[]
[]
[]
["＜免責事項＞"]
[]
["　１.計算ツールおよびその計算結果で提供する情報につきましては、当社がその内容を保証するものではありません。"]
[]
["　２.計算ツールまたはその計算結果のご利用により、利用者または第三者に生じた損害や不利益、トラブルについて、"]
["　　 当社はその一切の責任を負いません。"]
[]
["　３.計算ツールの内容については、予告なしに変更や削除を行う場合があります。"]
["　　 これらの変更や削除によって生じるいかなる損害や不利益についても、当社が責任を負うものではありません。"]
[]
["　４.計算ツールを含む本サイトに含まれるコンテンツおよびカタログ等の著作権、その他の一切の知的財産権は、"]
["     すべて当社に帰属するものであり、利用者にはいかなる権利も移転するものではありません。"]
[]
["　５.計算ツールの作成にあたっては細心の注意を払っておりますが、誤表記やプログラム上のバグがないこと、"]
["     計算結果の正確性、有用性、確実性等について、当社は一切保証するものではありません。"]